POLAND
type: Concept

PGI
type: Concept
in scheme: providers
definition: The Polish Geological Institute is the largest scientific and research geological institution of Poland. It was founded by the Polish Parliament in May 1919, just half a year after the Act of Independence. It is also one of the oldest scientific institutes in Poland. Summary Provided By: http://www.pgi.gov.pl/pgi_en/index.php?option=displaypage&Itemid=72&op=page&SubMenu=