OCEAN HEAT BUDGET
type: Concept

REFLECTANCE
type: Concept
in scheme: sciencekeywords
definition: In radiation transfer, reflectance is the fraction of incoming radiation that is reflected from a medium. The sum of this, the transmittance, and the absorptance must equal unity.