ACADEMIC
type: Concept

SUNY-BINGHAMTON/BIO
type: Concept
in scheme: providers
definition: The Binghamton University Department of Biological Sciences identifies fundamental areas of research that provide interfaces between academia and industry and to promote the development and expansion of a biotechnology industry in the Southern Tier by bringing together interdisciplinary faculty, regional academic institutions, clinical centers of excellence and the corporate sector in public/private partnership. Website: "http://biology.binghamton.edu/" [Summary provided by Binghamton University.]