A - C
type: Concept

CMS
type: Concept
change note: 2017-06-14 12:04:51.0 [sritz] update Definition (The NASA Carbon Monitoring System (CMS) is designed to make significant contributions in characterizing, quantifying, understanding, and predicting the evolution of global carbon sources and sinks through improved monitoring of carbon stocks and fluxes. The System will use the full range of NASA satellite observations and modeling/analysis capabilities to establish the accuracy, quantitative uncertainties, and utility of products for supporting national and international policy, regulatory, and management activities. CMS will maintain a global emphasis while providing finer scale regional information, utilizing space-based and surface-based data and will rapidly initiate generation and distribution of products both for user evaluation and to inform near-term policy development and planning.);
change note: 2014-11-12 08:16:41.0 [tbs1979] Insert Concept add broader relation (CMS [d287b7f5-7565-4602-a023-005578328c22,106669] - A - C [0c89f3f4-7ab1-43ce-89ee-795d35f0e30a,77505]);
change note: 2019-07-09 11:21:08.0 [tstevens] update Definition (The NASA Carbon Monitoring System (CMS) program is designed to make significant contributions in characterizing, quantifying, understanding, and predicting the evolution of global carbon sources and sinks through improved monitoring of carbon stocks and fluxes. The System uses NASA satellite observations and modeling/analysis capabilities to establish the accuracy, quantitative uncertainties, and utility of products for supporting national and international policy, regulatory, and management activities. CMS data products are designed to inform near-term policy development and planning.);
change note: 2014-11-12 08:17:29.0 [tbs1979] insert AltLabel (id: null text: Carbon Monitoring System language code: en);
definition: The NASA Carbon Monitoring System (CMS) program is designed to make significant contributions in characterizing, quantifying, understanding, and predicting the evolution of global carbon sources and sinks through improved monitoring of carbon stocks and fluxes. The System uses NASA satellite observations and modeling/analysis capabilities to establish the accuracy, quantitative uncertainties, and utility of products for supporting national and international policy, regulatory, and management activities. CMS data products are designed to inform near-term policy development and planning.
in scheme: projects