ACADEMIC
type: Concept

UC-BERKELEY/MVZ
type: Concept
change note: 2013-11-15 10:38:23.0 [gee-cee] insert AltLabel (id: null text: Museum of Vertebrate Zoology, University of California Berkeley language code: en);
change note: 2013-11-15 10:37:28.0 [gee-cee] Insert Concept add broader relation (UC-BERKELEY/MVZ [d2d93bf1-f537-4a25-bbe7-4e39f726339d,105925] - ACADEMIC [7700280b-68ee-4644-bf5e-84e7a6adf897,66467]);
in scheme: providers
definition: The Museum of Vertebrate Zoology (MVZ) at the University of California, Berkeley, is a center for research and education in the biology of amphibians, reptiles, birds, and mammals. Founded in 1908, the Museum's mission is to document and increase understanding of the diversity of terrestrial vertebrates, with particular emphasis on western North America. The superb collections are at the heart of the MVZ program, where methods of field biology are combined with modern laboratory techniques and analytical methods in a comprehensive, synthetic approach. Our goals are to remain at the forefront of international research on evolutionary biology from the perspectives of systematics, ecology, behavior, functional and developmental morphology, population biology, and evolutionary genomics, and to lead the way in developing and using major natural history collections for research, education, and solving problems in biodiversity conservation. Because the MVZ was founded upon a philosophy that organisms should be studied in relationship to their natural environments, its collections are supplemented by extensive ancillary information (e.g., field notes, habitat photographs, tape-recorded vocalizations) that is connected to specimens and/or tissues and enhances their value to researchers. This concept was pioneered at the MVZ and continues to be the primary focus of current research efforts. To this end, there are strong research links between the Museum and the 2,000 acre MVZ/UC field station at Hastings Natural History Reservation. In addition, the MVZ is actively engaged in developing concepts and tools for Biodiversity Informatics through collaborations across the Berkeley Natural History Museums and international consortia.