SPOT-3
type: Concept
change note: 2021-11-30 09:27:10.0 [tstevens] Move Concepts delete broader relation (null); add broader relation (SPOT-3 [d333cd96-f1f0-4179-9fbc-162b18fcb8c8,826778] - SPOT [5615d18d-4217-42a0-a53d-77298834fc2e,826260]);
change note: 2021-11-30 09:23:10.0 [tstevens] Move Concepts delete broader relation (null); add broader relation (SPOT-3 [d333cd96-f1f0-4179-9fbc-162b18fcb8c8,826778] - Earth Observation Satellites [3466eed1-2fbb-49bf-ab0b-dc08731d502b,826121]);
in scheme: platforms
definition: The SPOT-3 (Satellite Pour l'Observation de la Terre) spacecraft was launched in September 26,1993. SPOT-3 is a earth observation satellite with a ground resolution better than that of the Landsat series satellites. The main applications for the images returned by the third SPOT mission are land-use studies, agriculture and forestry resources, mineral and oil resources, and cartography. The three-axis stabilized satellite operates in a circular sun-synchronous near-polar orbit for a design lifetime of 2 years. Orbital Characteristics- Orbital Period: 101.20 m Inclination: 98.60 degrees Periapsis: 819.00 km Apoapsis: 846.00 km The spacecraft dimensions are 2 x 2 x 3.5 m and 15.60 m for the overall length of the deployed solar panel. SPOT-3 consists of two parts: (1) the bus, a standard multipurpose platform, and (2) the payload. The bus provides housekeeping information and an onboard computer. The payload is mounted on one of the side panels of the bus. It consists of two identical high-resolution visible (HRV) imaging instruments and a package comprising two magnetic-tape data recorders and a telemetry transmitter. The HRV imaging instrument observes in three spectral bands (in the visible and near infrared regions) with a ground resolution of 20 m, and/or in a broader spectral band (panchromatic black and white) with a ground resolution of 10 m. The pattern of successive ground tracks is repeated exactly at 26-day intervals. The SPOT-3 instrument package has the provision for off-nadir viewing which should be particularly useful for monitoring localized phenomena evolving on a relatively short timescale. Also, the satellite provides the capability for recording stereoscopic pairs of images of a given area during successive satellite passes. Group: Platform_Details Entry_ID: SPOT-3 Group: Platform_Identification Platform_Category: Earth Observation Satellites Platform_Series_or_Entity: SPOT Short_Name: SPOT-3 Long_Name: Systeme Probatoire Pour l'Observation de la T…

Systeme Probatoire Pour l'Observation de la Terre (SPOT)
type: Concept