USDA
type: Concept

USDA/NPS/PNWR
type: Concept
in scheme: providers
definition: The Pacific Northwest Region of the USDA Forest Service contains 19 National Forests, a National Scenic Area, a National Grassland, and two National Volcanic Monuments, all within the States of Oregon and Washington. The Forests provide timber for people, forage for cattle and wildlife, habitat for fish, plants, and animals, and some of the finest recreation lands in the country. Website: "http://www.fs.fed.us/r6/" [Summary provided by the USDA]