CANADA
type: Concept

CA/NRCAN/ESS/GC/CCRS/EMS
type: Concept
in scheme: providers
definition: Environmental indicators can serve as measuring sticks to track progress by governments, industries and individuals in protecting and improving the environment. Learn more about national progress on air quality, greenhouse gas emissions and freshwater quality in the newly released third annual Canadian Environmental Sustainability Indicators Highlights report. Summary Provided by: http://www.environmentandresources.ca/default.asp?lang=En&nav=B3BE4E55-00