NON-GOVERNMENT/NON-PROFIT ORGANIZATIONS
type: Concept

COMTF
type: Concept
in scheme: providers
definition: Since the mid 1990s, P. ramorum has caused substantial mortality in tanoak trees and several oak tree species (coast live oak, California black oak, Shreve oak, and canyon live oak), as well as twig and foliar diseases in numerous other plant species, including California bay laurel, Douglas-fir, and coast redwood. The pathogen was also discovered in European nurseries in the mid 1990s, and it has since spread to wildland trees in the U.K. and the Netherlands. Although the first P. ramorum-infested California nursery stock was identified in 2001 (Santa Cruz County), the U.S. nursery industry was not widely impacted by the disease until 2003, when the pathogen was detected in California, Oregon, Washington, and British Columbia nurseries. Summary Provided By; http://www.suddenoakdeath.org/html/history___background.html