Other
type: Concept

Maps
type: Concept
in scheme: platforms
definition: A map is a graphic representation of the Earth's surface. Maps can include street maps, world maps, country maps, state maps, historic maps and world maps.
change note: 2021-11-30 12:41:26.0 [tstevens] Insert Concept add broader relation (Maps [d53da93a-cc40-457a-a708-6bd4eeb1ffc1,835910] - Other [5cd7da77-cb95-40aa-8775-b6df68e0aa63,835876]);
change note: 2022-03-08 15:21:11.0 [tstevens] insert Definition (id: null text: A map is a graphic representation of the Earth's surface. Maps can include street maps, world maps, country maps, state maps, historic maps and world maps. language code: en);
change note: 2021-11-30 12:42:45.0 [tstevens] Move Concepts add narrower relation (Maps [d53da93a-cc40-457a-a708-6bd4eeb1ffc1,835910] - MAPS [8d56ab86-f13a-423b-b209-eca2baeb73ee,826495]);

MAPS
type: Concept