FARM STRUCTURES
type: Concept
in scheme: sciencekeywords
definition: Related to or about any permanent or temporary construction on a farm, ranch, or other agricultural land. This includes items such as barns, but also water improvements, fencing, shelters, henhouses, dams, etc...

AGRICULTURAL ENGINEERING
type: Concept