SURFRAD
type: Concept
change note: 2019-08-26 14:29:51.0 [sritz] insert AltLabel (id: null category: primary text: Surface Radiation Budget Network language code: en);
change note: 2021-11-18 08:24:48.0 [tstevens] Move Concepts delete broader relation (null); add broader relation (SURFRAD [d5456efc-ae6c-4c68-8b5e-66e40226d897,826786] - Permanent Land Sites [0ec10fd9-492c-498a-b6d8-e2840cc3643b,835887]);
change note: 2019-08-26 14:28:47.0 [sritz] Insert Concept add broader relation (SURFRAD [d5456efc-ae6c-4c68-8b5e-66e40226d897,369065] - SOLAR/SPACE MONITORING STATIONS [a143e5f5-4e4c-45cb-8053-5c9f6a099784,345507]);
change note: 2019-08-26 14:31:06.0 [sritz] insert Definition (id: null text: To understand the global surface energy budget is to understand climate. Because it is impractical to cover the earth with monitoring stations, the answer to global coverage lies in reliable satellite-based estimates. Efforts are underway at NASA and universities to develop algorithms to do this, but such projects are in their infancy. In concert with these ambitious efforts, accurate and precise ground-based measurements in differing climatic regions are essential to refine and verify the satellite-based estimates, as well as to support specialized research. To fill this niche, the Surface Radiation Budget Network (SURFRAD) was established in 1993 through the support of NOAA's Office of Global Programs. The SURFRAD mission is clear; its primary objective is to support climate research with accurate, continuous, long-term measurements of the surface radiation budget over the United States. This differs from DOE's ARM/SGP site, where surface radiation budget measurements are also being made, in that ARM uses clustered measurements over a limited area for process-oriented studies. language code: en);
in scheme: platforms
definition: To understand the global surface energy budget is to understand climate. Because it is impractical to cover the earth with monitoring stations, the answer to global coverage lies in reliable satellite-based estimates. Efforts are underway at NASA and universities to develop algorithms to do this, but such projects are in their infancy. In concert with these ambitious efforts, accurate and precise ground-based measurements in differing climatic regions are essential to refine and verify the satellite-based estimates, as well as to support specialized research. To fill this niche, the Surface Radiation Budget Network (SURFRAD) was established in 1993 through the support of NOAA's Office of Global Programs. The SURFRAD mission is clear; its primary objective is to support climate research with accurate, continuous, long-term measurements of the surface radiation budget over the United States. This differs from DOE's ARM/SGP site, where surface radiation budget measurements are also being made, in that ARM uses clustered measurements over a limited area for process-oriented studies.

Permanent Land Sites
type: Concept