ELECTRICAL FIELD
type: Concept

ELECTRICAL ANOMALIES
type: Concept
change note: 2017-03-10 10:35:12.0 [tstevens] update Definition (Honkura, Y. Geophysical Surveys (1978) 3: 225. doi:10.1007/BF01449555);
change note: 2013-03-11 14:19:19.0 [tbs1979] insert Definition (id: null text: A deviation from the normal or common order or form or rule. language code: en);
change note: 2013-02-18 10:08:42.0 [tbs1979] Insert Concept add broader relation (ELECTRICAL ANOMALIES [d55d29e8-9015-4c23-b137-528eb298aa49,82415] - ELECTRICAL FIELD [3202dab6-144a-4bfb-9bda-9d07e5ee7ec2,63911]);
in scheme: sciencekeywords
definition: A deviation from the normal or common order or form or rule.