SAVANNA
type: Concept
change note: 2016-07-12 09:46:11.0 [gee-cee] update PrefLabel (SAVANNA); insert Definition (id: null text: A rolling grassland scattered with shrubs and isolated trees, which can be found between a tropical rainforest and desert biome. Not enough rain falls on a savanna to support forests. Savannas are also known as tropical grasslands language code: en);
change note: 2016-07-12 09:43:37.0 [gee-cee] Insert Concept add broader relation (Savanna [d58dab07-f57e-47a9-8dcf-02a3e17f3533,247441] - GRASSLANDS [142ea0c1-b77f-44da-8c64-ac7ee13fd5f6,85105]);
in scheme: sciencekeywords
definition: A rolling grassland scattered with shrubs and isolated trees, which can be found between a tropical rainforest and desert biome. Not enough rain falls on a savanna to support forests. Savannas are also known as tropical grasslands

GRASSLANDS
type: Concept