COASTAL
type: Concept

KELP FOREST
type: Concept
change note: 2016-06-13 13:46:55.0 [gee-cee] insert Definition (id: null text: Pertaining areas of dense groupings of kelp species in cold and relatively shallow coastal waters. language code: en);
change note: 2016-06-13 13:46:19.0 [gee-cee] Insert Concept add broader relation (KELP FOREST [d609fc5c-8267-4e79-84ec-93629d52aba8,188221] - COASTAL HABITAT [47be68db-d10d-43e7-b150-61cfd3f06126,84259]);
in scheme: sciencekeywords
definition: Pertaining areas of dense groupings of kelp species in cold and relatively shallow coastal waters.