FEGS
type: Concept
change note: 2019-02-01 09:05:53.0 [tstevens] insert AltLabel (id: null category: primary text: Fly's Eye GLM Simulator language code: en); insert Definition (id: null text: FEGS is an airborne radiometer system designed to provide cal/val measurements for GLM from high altitude aircraft. It consists of a 5 x 5 array of radiometers each with a narrow passband filter to isolate the 777.4 nm neutral oxygen emission triplet radiated by lightning. The radiometers will measure the optical radiance emitted by lightning that is transmitted through the cloud top with a temporal resolution of 10 μs. When integrated on the NASA ER-2 aircraft, the FEGS array with its 90° field-of-view will observe a cloud top area nearly equal to a single GLM pixel. This design will allow FEGS to determine the temporal and spatial variation of light that contributes to a GLM event detection. language code: en);
change note: 2019-02-01 09:04:06.0 [tstevens] Insert Concept add broader relation (FEGS [d621a1c7-3d21-4c8d-833d-237f3e494b05,368465] - Imaging Spectrometers/Radiometers [944b7691-af37-4fb4-9393-c114e7997829,347979]);
in scheme: instruments
definition: FEGS is an airborne radiometer system designed to provide cal/val measurements for GLM from high altitude aircraft. It consists of a 5 x 5 array of radiometers each with a narrow passband filter to isolate the 777.4 nm neutral oxygen emission triplet radiated by lightning. The radiometers will measure the optical radiance emitted by lightning that is transmitted through the cloud top with a temporal resolution of 10 μs. When integrated on the NASA ER-2 aircraft, the FEGS array with its 90° field-of-view will observe a cloud top area nearly equal to a single GLM pixel. This design will allow FEGS to determine the temporal and spatial variation of light that contributes to a GLM event detection.

Imaging Spectrometers/Radiometers
type: Concept