FSU/SC
type: Concept
change note: 2012-08-16 12:41:42.0 [tbs1979] Insert Concept add broader relation (FSU/SC [d73528c4-2e34-4131-8c8f-f3f42878a416,40511] - ACADEMIC [7700280b-68ee-4644-bf5e-84e7a6adf897,24357]);
in scheme: providers
definition: The Department of Scientific Computing (SC) is the focal point of computational science activities at FSU. Computational science involves the invention, implementation, testing, and application of algorithms and software used to solve large-scale scientific and engineering problems. We provide a venue for innovative research and education in scientific computing. Our faculty come from a wide variety of traditional mathematical and scientific disciplines who are primarily interested in developing knowledge and tools for computational science and applying those tools for the solution of problems in a variety of applications

ACADEMIC
type: Concept