INFRASTRUCTURE
type: Concept

BUILDINGS
type: Concept
change note: 2012-07-11 10:26:42.0 [tbs1979] update Definition (A fabric or edifice that is constructed, such as a house, church, etc. ); update Definition (http://www.Dictionary.com);
in scheme: sciencekeywords
definition: A fabric or edifice that is constructed, such as a house, church, etc.