HYDROPEROXY
type: Concept
in scheme: sciencekeywords
definition: Consists of oxygenated compounds that are organic derivitives of hydrogen peroxide. These compounds are formed in the oxidation of hydrocarbons in relatively clean air, where oxides of nitrogen are not abundant.

HYDROGEN COMPOUNDS
type: Concept