OCEAN CHEMISTRY
type: Concept

INORGANIC CARBON
type: Concept
in scheme: sciencekeywords
definition: Carbon species that are not hydrocarbons or hydrocarbon derivatives. Variables such as dissolved inorganic carbon (DIC) or particulate inorganic carbon (PIC) are included as detailed variables under inorganic carbon.