GRIP (HURRICANE)
type: Concept
in scheme: projects
definition: The GRIP deployment was conducted 15 August – 30 September 2010 with bases in Ft. Lauderdale, FL for the DC-8, at Houston, TX for the WB-57, and at NASA Dryden Flight Research Facility, CA for the Global Hawk. This campaign will be conducted to capitalize on a number of ground networks, airborne science platforms (both manned and unmanned), and space-based assets. The field campaign will be executed according to a prioritized set of scientific objectives. Summary provided by: http://science.nasa.gov/missions/grip/ http://grip.nsstc.nasa.gov/

G - I
type: Concept