STS-51B
type: Concept
definition: The first dedicated mission with acquisition of science data as its primary objective, Spacelab 3 was a multidisciplinary mission emphasizing investigations requiring the low-gravity environment of Earth orbit. The experiments covered several disciplines. For the materials processing discipline, higher-quality crystals were grown by two methods; namely, seed crystal growth in a saturated solution and condensation from the vapor phase. The two fluid physics experiments studied the dynamic behavior of rotating and oscillating liquid drops, and the convection processes found in planetary atmospheres and in stellar interiors. The performance of equipment and facilities specially designed for investigations on the Spacelab Life Sciences mission series was evaluated. The investigations selected for the Spacelab 3 mission originated in the United States, France, and India, and represented a total of five different disciplines, including material science, life sciences, fluid mechanics, atmospheric science, and astronomy. Two of the investigations, one in material science and one in astronomy, had already flown aboard Spacelab 1. Many of the Spacelab 3 investigations were scheduled to be modified and reflown on later missions to further explore the discoveries of this mission. Some of the experiments were located in the module, some on the pallet in the payload bay, and one at middeck. Spacelab 3 consisted of a Spacelab long module and a pallet. The mission successfully demonstrated the capability of Spacelab for multidiscipline research in microgravity. [Summary provided by NASA.] Group: Platform_Details Entry_ID: STS-51B Group: Platform_Identification Platform_Category: Space Stations/Manned Spacecraft Platform_Series_or_Entity: SPACE SHUTTLE Short_Name: STS-51B Long_Name: Space Transport System STS-51B End_Group Group: Synonymous_Platform_Names Short_Name: Challenger End_Group Group: Orbit Orbit_Inclination: 28.45 degrees Perigee: 370 km Apogee: 370 km End_Group Creation…
change note: 2021-11-30 12:30:53.0 [tstevens] Move Concepts delete broader relation (null); add broader relation (STS-51B [da093451-5b0d-49cc-87ad-18ce04aff12f,826802] - SPACE SHUTTLE [3ef93fbf-1e19-42a9-a91f-502d125dbb7c,826168]);
change note: 2021-11-30 12:13:28.0 [tstevens] Move Concepts delete broader relation (null); add broader relation (STS-51B [da093451-5b0d-49cc-87ad-18ce04aff12f,826802] - Space Stations/Crewed Spacecraft [388e72a1-b851-4b78-9e69-747e06ae215f,826132]);
change note: 2021-11-30 12:06:14.0 [tstevens] Move Concepts delete broader relation (null); add broader relation (STS-51B [da093451-5b0d-49cc-87ad-18ce04aff12f,826802] - Space-based Platforms [b39a69b4-c3b9-4a94-b296-bbbbe5e4c847,835875]);
in scheme: platforms

Space Shuttle
type: Concept