Photon/Optical Detectors
type: Concept

MONOCHROMATORS
type: Concept
in scheme: instruments
definition: MONOCHROMATORS are instruments having or appearing to have only one color or put forth data in a range of tones of a single color.