SSDP
type: Concept
in scheme: projects
definition: The Salton Sea Database Program (SSDP) is an Environmental Protection Agency funded project at the University of Redlands to develop GIS data and research technologies to support the effort to save the Salton Sea from ecological collapse. The mission of the SSDP is to serve as an Area Information Steward and establish an on-line data resource clearinghouse and provide ecosystem decision support. By making available the inventories of existing data for the Salton Sea Science Sub-Committee and the research interests, the SSDP will save considerable time and money in the baseline reconnaissance, environmental review process, and long-tern ecosystem management for the Salton Sea. Project Website: "http://www.institute.redlands.edu/salton/"

S - U
type: Concept