FLUVIAL LANDFORMS
type: Concept

DELTAS
type: Concept
change note: 2013-08-15 12:39:22.0 [tbs1979] insert Definition (id: null text: Land built up by deposits of sand and silt at the mouth of some rivers. language code: en);
change note: 2013-08-05 12:30:00.0 [tbs1979] Insert Concept add broader relation (DELTAS [daa297ec-4397-4caa-b563-634a71f62b8a,105305] - FLUVIAL LANDFORMS [bdc0bd86-a3a3-48fa-b1fb-4ca5d13d4dde,105281]);
in scheme: sciencekeywords
definition: Land built up by deposits of sand and silt at the mouth of some rivers.