DATA INTEROPERABILITY
type: Concept

DATA REFORMATTING
type: Concept
in scheme: sciencekeywords
definition: Reformatting services are defined as Data Handling Services that allow for the alteration of the structure of an Earth science data set so as to make the data set accessible for use by a product or service for which it was not originally compatible. EXAMPLES: Binary to ASCII, HDF to CDF.