LENTICULAR CLOUDS
type: Concept

ALTOCUMULUS LENTICULARIS
type: Concept
change note: 2013-02-12 13:55:53.0 [mpmorahan] Insert Concept add broader relation (ALTOCUMULUS LENTICULARIS [dbc7fed3-ad30-4e57-868e-bae478713a71,82165] - ALTOCUMULUS [01021105-60ed-479a-a35b-faa73e286264,82159]);
change note: 2013-03-20 16:58:39.0 [mpmorahan] insert Definition (id: null text: "(Or lenticular cloud.) A cloud species the elements of which have the form of more or less isolated, generally smooth lenses or almonds; the outlines are sharp and sometimes show irisation. These clouds appear most often in formations of orographic origin, the result of lee waves, in which cases they remain nearly stationary with respect to the terrain (standing cloud), but they also occur in regions without marked orography. This species is found mainly in the genera cirrocumulus, altocumulus, and (rarely) stratocumulus. Altocumulus lenticularis differs from cirrocumulus lenticularis in that, when smooth and without elements, it has shadowed parts while the latter is very white throughout. When undulated or subdivided, the altocumulus species differs from stratocumulus lenticularis in that its elements subtend an angle of less than 5° when viewed at an angle of more than 30° above the horizon. language code: en);
change note: 2013-04-15 15:09:03.0 [mpmorahan] Insert Concept add narrower relation (ALTOCUMULUS LENTICULARIS [dbc7fed3-ad30-4e57-868e-bae478713a71,87473] - LENTICULAR CLOUDS [d5e72d73-22f6-4f4c-b937-b71d84960a1e,105089]);
definition: "(Or lenticular cloud.) A cloud species the elements of which have the form of more or less isolated, generally smooth lenses or almonds; the outlines are sharp and sometimes show irisation. These clouds appear most often in formations of orographic origin, the result of lee waves, in which cases they remain nearly stationary with respect to the terrain (standing cloud), but they also occur in regions without marked orography. This species is found mainly in the genera cirrocumulus, altocumulus, and (rarely) stratocumulus. Altocumulus lenticularis differs from cirrocumulus lenticularis in that, when smooth and without elements, it has shadowed parts while the latter is very white throughout. When undulated or subdivided, the altocumulus species differs from stratocumulus lenticularis in that its elements subtend an angle of less than 5° when viewed at an angle of more than 30° above the horizon.
in scheme: sciencekeywords

ALTOCUMULUS
type: Concept