Permanent Land Sites
type: Concept

GROUND-BASED OBSERVATIONS
type: Concept
in scheme: platforms
alternative label: GROUND-BASED OBSERVATION
definition: Observations that are located along the ground or land surface.
change note: 2016-06-09 14:42:47.0 [epneff] added altLabel insert AltLabel (id: null text: GROUND-BASED OBSERVATION language code: en);
change note: 2021-11-18 08:38:22.0 [tstevens] Move Concepts delete broader relation (null); add broader relation (GROUND-BASED OBSERVATIONS [dbcead38-c78b-4306-b56f-0ea15c0b755b,826813] - Land-based Platforms [3850efdc-1839-4881-a7c0-347b57587850,835872]);
change note: 2021-07-23 16:41:17.0 [sritz] insert AltLabel (id: null category: primary text: GROUND-BASED OBSERVATIONS language code: en);
change note: 2021-11-30 09:06:02.0 [tstevens] Move Concepts delete broader relation (null); add broader relation (GROUND-BASED OBSERVATIONS [dbcead38-c78b-4306-b56f-0ea15c0b755b,826813] - Permanent Land Sites [0ec10fd9-492c-498a-b6d8-e2840cc3643b,835887]);
change note: 2022-02-08 12:54:19.0 [tstevens] update Definition (Observations that are located along the ground or land surface.); update Definition (The American Heritage Dictionary of the English Language, Fourth Edition Copyright 2000 by Houghton Mifflin Compan);