ACID DEPOSITION
type: Concept
change note: 2012-06-29 14:34:29.0 [tbs1979] update Definition (Chiras, Daniel D. 1998. Environmental Science. A Systems Approach to Sustainable Development. Wadsworth Publishing Company. Belmont, California. ); update Definition (Acid deposition is rain or snow that has a lower pH than precipitation from unpolluted skies. Acid deposition can also include dry forms of deposition such as nitrate and sulfate particles);
in scheme: sciencekeywords
definition: Acid deposition is rain or snow that has a lower pH than precipitation from unpolluted skies. Acid deposition can also include dry forms of deposition such as nitrate and sulfate particles

ENVIRONMENTAL IMPACTS
type: Concept