GPCJR
type: Concept
in scheme: projects
definition: Geology and Paleontology of the River basin James Ross Group Lakes (Project in cooperation with National Agency of Scientific Promotion and Technological, University of the Center of the Province of Buenos Aires, Museum of Natural Sciences Bernardino Rivadavia, University of Torino (Italy) and University of Berlin (Germany)) Information provided by http://www.iaa.gov.ar/CIENCIA/ARCHHIST/20022004/GEO1.HTM

G - I
type: Concept