SIMS
type: Concept
in scheme: instruments
definition: Secondary Ion Mass Spectrometers (SIMS) are mass spectrometric techniques that are useful for the identification of polymer surfaces and fiber/polymer interfaces by the detection of ionic group clusters that are characteristic of specific polymers.

Spectrometers/Radiometers
type: Concept