WEIGHTED ANOMALY STANDARDIZED PRECIPITATION INDEX
type: Concept
change note: 2014-04-15 10:47:38.0 [128.183.164.42] added definition insert Definition (id: null text: The Weighted Anomaly Standardized Precipitation Index (WASP) index gives a standardized measure of precipitation excess or deficits over the selected accumulation period. language code: en);
change note: 2014-04-14 14:30:48.0 [128.183.164.42] Insert Concept add broader relation (WEIGHTED ANOMALY STANDARDIZED PRECIPITATION INDEX [dc9c73a3-689c-44b5-b8fe-a5229168193e,106333] - ATMOSPHERIC PRECIPITATION INDICES [c7477201-761f-4cd1-b986-3e99a0be866b,106325]);
in scheme: sciencekeywords
definition: The Weighted Anomaly Standardized Precipitation Index (WASP) index gives a standardized measure of precipitation excess or deficits over the selected accumulation period.

ATMOSPHERIC PRECIPITATION INDICES
type: Concept