LANDSCAPE
type: Concept

REFORESTATION
type: Concept
change note: 2017-03-10 09:00:55.0 [tstevens] update Definition (USDA);
change note: 2013-08-15 14:16:35.0 [tbs1979] update Definition (The natural or intentional restocking of existing forests and woodlands that have been depleted, usually through deforestation.); update Definition ();
in scheme: sciencekeywords
definition: The natural or intentional restocking of existing forests and woodlands that have been depleted, usually through deforestation.