BASS2000
type: Concept
in scheme: providers
definition: The database solar basement, BASS 2000, the first designed to archive all data from solar observing instruments on the ground. The instruments are: Franco-Italian telescope THEMIS installed in the Canary Islands (Spain) solar instruments still in operation at the Pic du Midi de Bigorre (Lunette Jean Rösch and coronograph CLIMSO) the Spectroheliograph of the Observatoire de Paris Meudon or the Radioheliograph Nançay. Summary provided by http://bass2000.obspm.fr/home.php

CONSORTIA/INSTITUTIONS
type: Concept