Thermo Scientific CO Analyzer
type: Concept
change note: 2021-05-11 08:02:32.0 [tstevens] insert AltLabel (id: null category: primary text: Thermo Scientific Model 48i-TLE Enhanced Trace Level CO Analyzer language code: en); insert Definition (id: null text: Measure trace levels of carbon monoxide (CO) in ambient air with the Thermo Scientific™ Model 48i-TLE Enhanced Trace Level CO Analyzer, which utilizes gas filter correlation and NDIR technology. The enhanced sample conditioned temperature stabilization and auto-zeroing of the Model 48-TLE result in a low detection limit for the measurement of carbon monoxide. language code: en);
change note: 2021-05-11 08:01:00.0 [tstevens] Insert Concept add broader relation (Thermo Scientific CO Analyzer [dce07da6-0bd2-4b0e-b6dc-029798ff0ceb,606919] - Chemical Meters/Analyzers [3d25724b-832f-4a61-b0b2-4f2ccecdba94,598603]);
in scheme: instruments
definition: Measure trace levels of carbon monoxide (CO) in ambient air with the Thermo Scientific™ Model 48i-TLE Enhanced Trace Level CO Analyzer, which utilizes gas filter correlation and NDIR technology. The enhanced sample conditioned temperature stabilization and auto-zeroing of the Model 48-TLE result in a low detection limit for the measurement of carbon monoxide.

Chemical Meters/Analyzers
type: Concept