LACUSTRINE WETLANDS
type: Concept
in scheme: sciencekeywords
definition: Lacustrine Wetlands are lakes, or former lakes, that are naturally filled with shallow water at certain times and more or less drained at other times.

WETLANDS
type: Concept