WLDELFT
type: Concept
in scheme: providers
definition: WL | Delft Hydraulics is an independent research institute and specialist consultancy based in the Netherlands. The Institute has been providing clients, at home and abroad, with expert advice and technical assistance on water-related issues for over 75 years. Our staff of 350 qualified and committed professionals combines an in-depth command of critical details with an across-the-board overview. With a sound understanding of the processes involved and the right facilities, all water systems can be simulated - numerically, experimentally, or through a combination of the two. WL | Delft Hydraulics is well known for both its experimental facilities and its software, most of which has been developed and validated in-house. Our software products are being used all over the world in a great variety of commercial projects and research studies. Website: "http://www.wldelft.nl/" [Summary provided by WL | Delft Hydraulics]

COMMERCIAL
type: Concept