Himawari-8
type: Concept
change note: 2018-07-27 16:20:38.0 [sritz] Move Concepts delete narrower relation (null);
change note: 2017-09-27 16:58:38.0 [sritz] update WeightedRelation (Platform-Instrument); update WeightedRelation (1);
change note: 2018-07-27 16:20:17.0 [sritz] Insert Concept add narrower relation (Himawari-8 [dd2591d9-35a1-4037-9664-bbfcf4c80b71,345927] - Himawari-9 [e43cfa6a-fb75-4eeb-8674-25917275ea7e,368003]);
change note: 2017-09-27 16:43:41.0 [sritz] insert Definition (id: null text: Himawari 8 (ひまわり8号) is a Japanese weather satellite, the 8th of the Himawari geostationary weather satellites operated by the Japan Meteorological Agency. The spacecraft was constructed by Mitsubishi Electric with assistance from Boeing, and is the first of two similar satellites to be based on the DS-2000 satellite bus.[3] Himawari 8 entered operational service on 7 July 2015 and is the successor to MTSAT-2 (Himawari 7) which was launched in 2006. language code: en);
change note: 2017-09-27 16:58:11.0 [sritz] insert WeightedRelation (id: null related concept uuid: 228edef6-d682-40eb-8b41-e37c78b9e7c5 relationship type: null relationship value: null generated by: null);
change note: 2017-09-27 16:38:46.0 [sritz] Insert Concept add broader relation (Himawari-8 [dd2591d9-35a1-4037-9664-bbfcf4c80b71,310217] - Himawari [d8b7fc7d-9cf3-4020-947d-f33d712b64ab,310213]);
in scheme: platforms
definition: Himawari 8 (ひまわり8号) is a Japanese weather satellite, the 8th of the Himawari geostationary weather satellites operated by the Japan Meteorological Agency. The spacecraft was constructed by Mitsubishi Electric with assistance from Boeing, and is the first of two similar satellites to be based on the DS-2000 satellite bus.[3] Himawari 8 entered operational service on 7 July 2015 and is the successor to MTSAT-2 (Himawari 7) which was launched in 2006.

Himawari
type: Concept