D - F
type: Concept

DCOTSS
type: Concept
change note: 2020-02-10 08:26:51.0 [tstevens] insert AltLabel (id: null category: primary text: Dynamics and Chemistry of the Summer Stratosphere language code: en); insert Definition (id: null text: Dynamics and Chemistry of the Summer Stratosphere (DCOTSS) is a NASA Earth Venture Suborbital research project to investigate the impacts of intense thunderstorms over the U.S. on the summertime stratosphere. language code: en);
change note: 2020-02-10 08:23:51.0 [tstevens] Insert Concept add broader relation (DCOTSS [dd7b9be5-7fe0-40a2-a152-4f8fece249f9,559819] - D - F [24cf4b0e-4464-4edb-8f0c-415e851a6d79,546895]);
in scheme: projects
definition: Dynamics and Chemistry of the Summer Stratosphere (DCOTSS) is a NASA Earth Venture Suborbital research project to investigate the impacts of intense thunderstorms over the U.S. on the summertime stratosphere.