IDAHO
type: Concept

ID/DWR
type: Concept
in scheme: providers
definition: The Idaho Department of Water Resources is headed by a director appointed by the governor. The agency is divided into three operating divisions, each headed by an administrator. Each division then has bureaus, sections or teams organized around specific areas of responsibility. Summary Provided By: http://www.idwr.idaho.gov/about/orgpage.htm