U-LAPLAND/AC
type: Concept
in scheme: providers
definition: Geophysics research at the University of Helsinki is is divided into three fields: -Snow, ice and lake research (comprising glaciology, hydrology and limnology) -Ocean modeling and marine systems research (comprising oceanography and climate research) -Solid earth geophysics (comprising seismology, geomagnetism, geodesy and planetary geophysics) Website: http://www.geophysics.helsinki.fi/ [Summary provided by the University of Lapland, Finland.]

ACADEMIC
type: Concept