U-WAU/MATH-S
type: Concept
in scheme: providers
definition: The University of Western Australia School of Mathematics and Statistics conducts research in applied mathematics, statistics, and probability The following is a partial list of mathematical studies that are conducted at the University: -Algebra -Applied Probability -Applied Mathematical Methods -Applied Mathematics -Bioinformatics -Biomechanics -Climate and Weather -Computational Fluid Dynamics -Computing -Differential Equations -Differential Geometry Website: https://www.maths.uwa.edu.au/

ACADEMIC
type: Concept