M - O
type: Concept

MONITOREO VOLCANOLOGICO
type: Concept
in scheme: projects
definition: The Observatory Volcanológico Deception (OVD) was created in the austral summer of 1993 by the Argentine Antarctic Institute - University of Buenos Aires and the Higher Council for Scientific Research (CSIC) - National Museum of Natural Sciences of Spain. It is headquartered in Argentina Deception and the Base was established in response to the revival occurring in the volcanic Deception Island during the summer of 1991-1992. Las tareas de estudio y seguimiento del sistema volcánico son realizadas por investigadores argentinos y españoles, durante el verano austral de cada año (de diciembre a marzo). The tasks of study and monitoring of volcanic system are carried out by researchers Argentines and Spaniards, during the austral summer of each year (December-March). Las actividades del Observatorio Volcanológico Decepción incluyen principalmente tareas de monitoreo sísmico y seguimiento de la composición química de los gases fumarólicos, además de estudios de gravimetría, magnetometría y controles termométricos de fumarolas y suelos calientes, entre otros. http://translate.google.com/translate?hl=en&sl=es&u=http://www.gesva.gl.fcen.uba.ar/observatorio.htm&sa=X&oi=translate&resnum=1&ct=result&prev=/search%3Fq%3DVOLCANOLOGIA%2BDECEPCION%26hl%3Den%26client%3Dfirefox-a%26channel%3Ds%26rls%3Dorg.mozilla:en-US:official%26hs%3DGzH%26sa%3DG