D - F
type: Concept

ECCO
type: Concept
change note: 2019-11-25 12:45:56.0 [mmorahan] insert AltLabel (id: null category: primary text: Estimating the Circulation and Climate of the Ocean language code: en); insert Definition (id: null text: The “Estimating the Circulation and Climate of the Ocean” (ECCO) consortium is directed at making the best possible estimates of ocean circulation and its role in climate. Solutions are obtained by combining state-of-the-art ocean circulation models with nearly complete global ocean data sets in a physically and statistically consistent manner. Products are being utilized to understanding ocean variability, biological cycles, coastal physics, and geodesy, and are available for general applications. language code: en);
change note: 2019-11-25 12:43:52.0 [mmorahan] Insert Concept add broader relation (ECCO [de863e7e-caf7-4beb-ab2e-b9f37d96d534,423559] - D - F [24cf4b0e-4464-4edb-8f0c-415e851a6d79,410731]);
in scheme: projects
definition: The “Estimating the Circulation and Climate of the Ocean” (ECCO) consortium is directed at making the best possible estimates of ocean circulation and its role in climate. Solutions are obtained by combining state-of-the-art ocean circulation models with nearly complete global ocean data sets in a physically and statistically consistent manner. Products are being utilized to understanding ocean variability, biological cycles, coastal physics, and geodesy, and are available for general applications.