COASTAL PROCESSES
type: Concept

WAVE REFRACTION
type: Concept
change note: 2013-08-20 10:06:24.0 [tbs1979] insert Definition (id: null text: The change in direction of a wave due to a change in its medium. It is essentially a surface phenomenon. language code: en);
change note: 2013-08-06 08:41:12.0 [tbs1979] Insert Concept add broader relation (WAVE REFRACTION [df4a0112-3aba-41ca-816a-86129cacb6a5,105591] - COASTAL PROCESSES [e26803a0-82ea-40c4-a41a-9e222c9bd09a,86507]);
in scheme: sciencekeywords
definition: The change in direction of a wave due to a change in its medium. It is essentially a surface phenomenon.