FEATURE GENERALIZATION SERVICES
type: Concept
in scheme: sciencekeywords
definition: Service that reduces spatial variation in a feature collection to counteract the undesirable effects of scale reduction.

DATA PROCESSING SERVICES
type: Concept