NASA/JPL/PODAAC/NEREIDS
type: Concept
in scheme: providers
definition: The Physical Oceanography Distributed Active Archiving Center (PO.DAAC), NASA's primary data center for archiving and distributing oceanographic data, is supporting the Jason and TOPEX/Poseidon satellite tandem mission. by providing a variety of data products, tools, and distribution methods to the wider scientific and general community. PO.DAAC bas developed several new data products for sea level residual measurements, providing a longterm climate data record from 1992 to the present These products provide compatible measurements of sea level residuals for the entire time series including the tandem TOPEX/Poseidon and Jason mission. Several data distribution tool. are available from NASA PO.DAAC. The Near-Real-Time Image Distribution Server (NEREIDS) provides quicklook browse images and binary data files The PO.DAAC Ocean ESIP Tool (POE]) provides interactive, on-tine data subsetting and visualization for several altimetry data products. Summary Provided By: http://trs-new.jpl.nasa.gov/dspace/handle/2014/40746

NASA
type: Concept