IRNSS
type: Concept

IRNSS P
type: Concept
change note: 2017-08-15 07:44:50.0 [tstevens] update AltLabel (India's Regional Navigation Satellite System Payload);
change note: 2017-08-15 10:45:01.0 [tstevens] insert Definition (id: null text: IRNSS is a regional navigation satellite system developed in India and consisting of seven satellites. IRNSS provides a standard positioning service to all users and a restricted service to authorized users. language code: en);
change note: 2017-08-14 15:46:05.0 [tstevens] Insert Concept add broader relation (IRNSS P [dfbee37a-ab88-48a9-b47b-647d0e11393d,310027] - IRNSS [4ddf95f4-82a3-4402-b17c-12388347f659,310015]);
change note: 2017-08-14 15:46:21.0 [tstevens] insert AltLabel (id: null category: primary text: India’s Regional Navigation Satellite System Payload language code: en);
definition: IRNSS is a regional navigation satellite system developed in India and consisting of seven satellites. IRNSS provides a standard positioning service to all users and a restricted service to authorized users.
in scheme: instruments