CANADA
type: Concept

CA/BC/SRM
type: Concept
in scheme: providers
definition: Ministry of Sustainable Resource Management, is the lead provincial agency responsible for planning, policies and resource information in support of the sustainable economic development of Crown land, water and resources.