SNOW/ICE
type: Concept

SNOW/ICE CHEMISTRY
type: Concept
change note: 2021-08-31 09:02:18.0 [tstevens] update Definition (Refers to the chemical composition of snow and ice as determined from snow cores, ice cores, and snow pits.); update Definition (Goudie, Andrew. 1997. The Encyclopedic Dictionary of Physical Geography. Blackwell Publishing, Malden, Massachusetts.);
in scheme: sciencekeywords
definition: Refers to the chemical composition of snow and ice as determined from snow cores, ice cores, and snow pits.